Reaction Details
TargetSerine/threonine-protein kinase pim-1
LigandBDBM106870
Substrate/Competitorn/a
Meas. Tech.ChEMBL_2068630 (CHEMBL4723883)
Ki<1.000000±n/a nM
Citation Han, WDing, YChen, ZLangowski, JLBellamacina, CRico, ANishiguchi, GALan, JAtallah, GLindvall, MLin, SZang, RFeucht, PZavorotinskaya, TDai, YGarcia, PBurger, MT Synthesis and Structure-Activity Relationship of Tetra-Substituted Cyclohexyl Diol Inhibitors of Proviral Insertion of Moloney Virus (PIM) Kinases. J Med Chem63:14885-14904 (2020) 
 
Serine/threonine-protein kinase pim-1
Name:Serine/threonine-protein kinase pim-1
Type:Protein
Mol. Mass.:35681.82
Organism:Homo sapiens (Human)
Description:P11309
Residue:313
BDBM106870
NameBDBM106870
Synonyms:US8592455, 70
TypeSmall organic molecule
Emp. Form.C24H23F3N4O
Mol. Mass.440.4608
SMILESC[C@@H]1C[C@H](N)C[C@@H](C1)c1ccncc1NC(=O)c1ccc(F)c(n1)-c1c(F)cccc1F