Reaction Details
TargetSerine/threonine-protein kinase pim-1
LigandBDBM50559304
Substrate/Competitorn/a
Meas. Tech.ChEMBL_2068630 (CHEMBL4723883)
Ki<1.000000±n/a nM
Citation Han, WDing, YChen, ZLangowski, JLBellamacina, CRico, ANishiguchi, GALan, JAtallah, GLindvall, MLin, SZang, RFeucht, PZavorotinskaya, TDai, YGarcia, PBurger, MT Synthesis and Structure-Activity Relationship of Tetra-Substituted Cyclohexyl Diol Inhibitors of Proviral Insertion of Moloney Virus (PIM) Kinases. J Med Chem63:14885-14904 (2020) 
 
Serine/threonine-protein kinase pim-1
Name:Serine/threonine-protein kinase pim-1
Type:Protein
Mol. Mass.:35681.82
Organism:Homo sapiens (Human)
Description:P11309
Residue:313
BDBM50559304
NameBDBM50559304
Synonyms:CHEMBL4783935
TypeSmall organic molecule
Emp. Form.C23H23F2N3O3S
Mol. Mass.459.509
SMILESC[C@H]1C[C@H](C[C@@H](O)[C@]1(C)O)c1ccncc1NC(=O)c1csc(n1)-c1c(F)cccc1F