Reaction Details
TargetSerine/threonine-protein kinase pim-2
LigandBDBM50559297
Substrate/Competitorn/a
Meas. Tech.ChEMBL_2068631 (CHEMBL4723884)
Ki<3.0±n/a nM
Citation Han, WDing, YChen, ZLangowski, JLBellamacina, CRico, ANishiguchi, GALan, JAtallah, GLindvall, MLin, SZang, RFeucht, PZavorotinskaya, TDai, YGarcia, PBurger, MT Synthesis and Structure-Activity Relationship of Tetra-Substituted Cyclohexyl Diol Inhibitors of Proviral Insertion of Moloney Virus (PIM) Kinases. J Med Chem63:14885-14904 (2020) 
 
Serine/threonine-protein kinase pim-2
Name:Serine/threonine-protein kinase pim-2
Type:Serine/threonine-protein kinase
Mol. Mass.:34185.93
Organism:Homo sapiens (Human)
Description:Q9P1W9
Residue:311
BDBM50559297
NameBDBM50559297
Synonyms:CHEMBL4763702
TypeSmall organic molecule
Emp. Form.C24H25F2N5O3
Mol. Mass.469.4838
SMILESC[C@H]1C[C@H](C[C@@H](O)[C@@]1(O)CF)c1ccncc1NC(=O)c1nc(ccc1N)-c1ncccc1F