Reaction Details
TargetSerine/threonine-protein kinase pim-3
LigandBDBM50559304
Substrate/Competitorn/a
Meas. Tech.ChEMBL_2068632 (CHEMBL4723885)
Ki<3.0±n/a nM
Citation Han, WDing, YChen, ZLangowski, JLBellamacina, CRico, ANishiguchi, GALan, JAtallah, GLindvall, MLin, SZang, RFeucht, PZavorotinskaya, TDai, YGarcia, PBurger, MT Synthesis and Structure-Activity Relationship of Tetra-Substituted Cyclohexyl Diol Inhibitors of Proviral Insertion of Moloney Virus (PIM) Kinases. J Med Chem63:14885-14904 (2020) 
 
Serine/threonine-protein kinase pim-3
Name:Serine/threonine-protein kinase pim-3
Type:Protein
Mol. Mass.:35888.19
Organism:Homo sapiens (Human)
Description:Q86V86
Residue:326
BDBM50559304
NameBDBM50559304
Synonyms:CHEMBL4783935
TypeSmall organic molecule
Emp. Form.C23H23F2N3O3S
Mol. Mass.459.509
SMILESC[C@H]1C[C@H](C[C@@H](O)[C@]1(C)O)c1ccncc1NC(=O)c1csc(n1)-c1c(F)cccc1F