Reaction Details
TargetSerine/threonine-protein kinase pim-3
LigandBDBM50559303
Substrate/Competitorn/a
Meas. Tech.ChEMBL_2068632 (CHEMBL4723885)
Ki<3.0±n/a nM
Citation Han, WDing, YChen, ZLangowski, JLBellamacina, CRico, ANishiguchi, GALan, JAtallah, GLindvall, MLin, SZang, RFeucht, PZavorotinskaya, TDai, YGarcia, PBurger, MT Synthesis and Structure-Activity Relationship of Tetra-Substituted Cyclohexyl Diol Inhibitors of Proviral Insertion of Moloney Virus (PIM) Kinases. J Med Chem63:14885-14904 (2020) 
 
Serine/threonine-protein kinase pim-3
Name:Serine/threonine-protein kinase pim-3
Type:Protein
Mol. Mass.:35888.19
Organism:Homo sapiens (Human)
Description:Q86V86
Residue:326
BDBM50559303
NameBDBM50559303
Synonyms:CHEMBL4741855
TypeSmall organic molecule
Emp. Form.C25H24F3N3O3
Mol. Mass.471.4716
SMILESC[C@H]1C[C@H](C[C@@H](O)[C@]1(C)O)c1ccncc1NC(=O)c1ccc(F)c(n1)-c1c(F)cccc1F