Reaction Details
TargetSerine/threonine-protein kinase pim-3
LigandBDBM106801
Substrate/Competitorn/a
Meas. Tech.ChEMBL_2068632 (CHEMBL4723885)
Ki 3.0±n/a nM
Citation Han, WDing, YChen, ZLangowski, JLBellamacina, CRico, ANishiguchi, GALan, JAtallah, GLindvall, MLin, SZang, RFeucht, PZavorotinskaya, TDai, YGarcia, PBurger, MT Synthesis and Structure-Activity Relationship of Tetra-Substituted Cyclohexyl Diol Inhibitors of Proviral Insertion of Moloney Virus (PIM) Kinases. J Med Chem63:14885-14904 (2020) 
 
Serine/threonine-protein kinase pim-3
Name:Serine/threonine-protein kinase pim-3
Type:Protein
Mol. Mass.:35888.19
Organism:Homo sapiens (Human)
Description:Q86V86
Residue:326
BDBM106801
NameBDBM106801
Synonyms:US8592455, 1
TypeSmall organic molecule
Emp. Form.C24H22F3N3O2
Mol. Mass.441.4456
SMILESC[C@@H]1C[C@H](O)C[C@@H](C1)c1ccncc1NC(=O)c1ccc(F)c(n1)-c1c(F)cccc1F