Reaction Details
TargetProcathepsin L
LigandBDBM50121912
Substrate/Competitorn/a
Meas. Tech.ChEBML_48362
IC50 17±n/a nM
Citation Zhou, NEGuo, DThomas, GReddy, AVKaleta, JPurisima, EMenard, RMicetich, RGSingh, R 3-Acylamino-azetidin-2-one as a novel class of cysteine proteases inhibitors. Bioorg Med Chem Lett13:139-41 (2002) Procathepsin L
Name:Procathepsin L
Type:Enzyme
Mol. Mass.:37557.19
Organism:Homo sapiens (Human)
Description:Purchased from Calbiochem (San Diego, CA).
Residue:333
BDBM50121912
NameBDBM50121912
Synonyms:CHEMBL282602 | [(S)-1-((3S,4S)-2-Oxo-4-phenoxy-azetidin-3-ylcarbamoyl)-2-phenyl-ethyl]-carbamic acid benzyl ester
TypeSmall organic molecule
Emp. Form.C26H25N3O5
Mol. Mass.459.4938
SMILESO=C(N[C@@H](Cc1ccccc1)C(=O)N[C@H]1[C@@H](NC1=O)Oc1ccccc1)OCc1ccccc1