Reaction Details
TargetCathepsin B
LigandBDBM50121909
Substrate/Competitorn/a
Meas. Tech.ChEBML_47599
IC50 11400±n/a nM
Citation Zhou, NEGuo, DThomas, GReddy, AVKaleta, JPurisima, EMenard, RMicetich, RGSingh, R 3-Acylamino-azetidin-2-one as a novel class of cysteine proteases inhibitors. Bioorg Med Chem Lett13:139-41 (2002) Cathepsin B
Name:Cathepsin B
Type:Protein
Mol. Mass.:37463.53
Organism:Rattus norvegicus
Description:P00787
Residue:339
BDBM50121909
NameBDBM50121909
Synonyms:CHEMBL30957 | [(S)-1-((2S,3S)-2-tert-Butoxy-4-oxo-azetidin-3-ylcarbamoyl)-2-phenyl-ethyl]-carbamic acid benzyl ester
TypeSmall organic molecule
Emp. Form.C24H29N3O5
Mol. Mass.439.5042
SMILESCC(C)(C)O[C@@H]1NC(=O)[C@H]1NC(=O)[C@H](Cc1ccccc1)NC(=O)OCc1ccccc1