Reaction Details
TargetCathepsin B
LigandBDBM50121907
Substrate/Competitorn/a
Meas. Tech.ChEBML_47599
IC50 10500±n/a nM
Citation Zhou, NEGuo, DThomas, GReddy, AVKaleta, JPurisima, EMenard, RMicetich, RGSingh, R 3-Acylamino-azetidin-2-one as a novel class of cysteine proteases inhibitors. Bioorg Med Chem Lett13:139-41 (2002) Cathepsin B
Name:Cathepsin B
Type:Protein
Mol. Mass.:37463.53
Organism:Rattus norvegicus
Description:P00787
Residue:339
BDBM50121907
NameBDBM50121907
Synonyms:CHEMBL31788 | [(S)-1-((3R,4S)-2-Oxo-4-phenylsulfanyl-azetidin-3-ylcarbamoyl)-2-phenyl-ethyl]-carbamic acid benzyl ester
TypeSmall organic molecule
Emp. Form.C26H25N3O4S
Mol. Mass.475.559
SMILESO=C(N[C@@H](Cc1ccccc1)C(=O)N[C@H]1[C@@H](NC1=O)Sc1ccccc1)OCc1ccccc1