Reaction Details
TargetCathepsin K
LigandBDBM50121911
Substrate/Competitorn/a
Meas. Tech.ChEBML_45544
IC50 100±n/a nM
Citation Zhou, NEGuo, DThomas, GReddy, AVKaleta, JPurisima, EMenard, RMicetich, RGSingh, R 3-Acylamino-azetidin-2-one as a novel class of cysteine proteases inhibitors. Bioorg Med Chem Lett13:139-41 (2002) Cathepsin K
Name:Cathepsin K
Type:Enzyme
Mol. Mass.:36975.68
Organism:Homo sapiens (Human)
Description:P43235
Residue:329
BDBM50121911
NameBDBM50121911
Synonyms:Benzoic acid (2S,3S)-3-((S)-2-benzyloxycarbonylamino-3-phenyl-propionylamino)-4-oxo-azetidin-2-yl ester | CHEMBL285585
TypeSmall organic molecule
Emp. Form.C27H25N3O6
Mol. Mass.487.5039
SMILESO=C(N[C@@H](Cc1ccccc1)C(=O)N[C@H]1[C@@H](NC1=O)OC(=O)c1ccccc1)OCc1ccccc1