Reaction Details
TargetRetinoic acid receptor RXR-alpha
LigandBDBM50122348
Substrate/Competitorn/a
Meas. Tech.ChEMBL_196753 (CHEMBL803333)
EC50 30±n/a nM
Citation Farmer, LJZhi, LJeong, SLamph, WWOsburn, DLCroston, GFlatten, KSHeyman, RANadzan, AM Retinoic acid receptor ligands based on the 6-cyclopropyl-2,4-hexadienoic acid. Bioorg Med Chem Lett13:261-4 (2002) Retinoic acid receptor RXR-alpha
Name:Retinoic acid receptor RXR-alpha
Type:PROTEIN
Mol. Mass.:50820.38
Organism:Homo sapiens (Human)
Description:ChEMBL_1456363
Residue:462
BDBM50122348
NameBDBM50122348
Synonyms:(2E,4E)-6-[1-(3,5-Di-tert-butyl-phenyl)-cyclopropyl]-3-methyl-hexa-2,4-dienoic acid | CHEMBL89581
TypeSmall organic molecule
Emp. Form.C24H34O2
Mol. Mass.354.5256
SMILESC\C(\C=C\CC1(CC1)c1cc(cc(c1)C(C)(C)C)C(C)(C)C)=C/C(O)=O