Reaction Details
TargetProto-oncogene tyrosine-protein kinase Src
LigandBDBM255303
Substrate/Competitorn/a
Meas. Tech.ChEMBL_2071894 (CHEMBL4727428)
IC50 69±n/a nM
Citation Liu, JGuiadeen, DKrikorian, AGao, XWang, JBabu Boga, SAlhassan, ABYu, WSelyutin, OYu, YAnand, RXu, JKelly, JDuffy, JLLiu, SYang, CWu, HCai, JBennett, CMaloney, KMTyagarajan, SGao, YDFischmann, TOPresland, JMansueto, MXu, ZLeccese, EZhang-Hoover, JKnemeyer, IGarlisi, CGStivers, PBrandish, PEHicks, AKim, RKozlowski, JA Potent, non-covalent reversible BTK inhibitors with 8-amino-imidazo[1,5-a]pyrazine core featuring 3-position bicyclic ring substitutes. Bioorg Med Chem Lett30:0 (2020) 
 
Proto-oncogene tyrosine-protein kinase Src
Name:Proto-oncogene tyrosine-protein kinase Src
Type:Protein
Mol. Mass.:59838.60
Organism:Homo sapiens (Human)
Description:P12931
Residue:536
BDBM255303
NameBDBM255303
Synonyms:US9481682, 52
TypeSmall organic molecule
Emp. Form.C28H26F3N7O3
Mol. Mass.565.5463
SMILESCC1(C)OC(=O)N2C[C@@H](CC[C@@H]12)c1nc(-c2ccc(cc2)C(=O)Nc2cc(ccn2)C(F)(F)F)c2c(N)nccn12