Reaction Details
TargetcGMP-specific 3',5'-cyclic phosphodiesterase
LigandBDBM50122964
Substrate/Competitorn/a
Meas. Tech.ChEMBL_155375 (CHEMBL760828)
Ki 0.350000±n/a nM
Citation Jiang, WSui, ZMacielag, MJWalsh, SPFiordeliso, JJLanter, JCGuan, JQiu, YKraft, PBhattacharjee, SCraig, EHaynes-Johnson, DJohn, TMClancy, J Furoyl and benzofuroyl pyrroloquinolones as potent and selective PDE5 inhibitors for treatment of erectile dysfunction. J Med Chem46:441-4 (2003) 
 
cGMP-specific 3',5'-cyclic phosphodiesterase
Name:cGMP-specific 3',5'-cyclic phosphodiesterase
Type:Protein
Mol. Mass.:99975.83
Organism:Homo sapiens (Human)
Description:O76074
Residue:875
BDBM50122964
NameBDBM50122964
Synonyms:3-Benzo[1,3]dioxol-5-yl-2-(6-hydroxy-benzofuran-2-carbonyl)-1,2,3,4-tetrahydro-pyrrolo[3,4-b]quinolin-9-one | CHEMBL336003
TypeSmall organic molecule
Emp. Form.C27H18N2O6
Mol. Mass.466.4416
SMILESOc1ccc2cc(oc2c1)C(=O)N1Cc2c(nc3ccccc3c2O)C1c1ccc2OCOc2c1