Reaction Details
TargetSodium-dependent serotonin transporter
LigandBDBM50029150
Substrate/Competitorn/a
Meas. Tech.ChEBML_201994
Ki 2.5±n/a nM
Citation van Hes, RSmid, PStroomer, CNTipker, KTulp, MTvan der Heyden, JAMcCreary, ACHesselink, MBKruse, CG SLV310, a novel, potential antipsychotic, combining potent dopamine D2 receptor antagonism with serotonin reuptake inhibition. Bioorg Med Chem Lett13:405-8 (2003) Sodium-dependent serotonin transporter
Name:Sodium-dependent serotonin transporter
Type:Multi-pass membrane protein
Mol. Mass.:70168.43
Organism:Rattus norvegicus (rat)
Description:P31652
Residue:630
BDBM50029150
NameBDBM50029150
Synonyms:3-(2-Piperidin-4-yl-ethyl)-1H-indole Indalpine
TypeSmall organic molecule
Emp. Form.C15H20N2
Mol. Mass.228.3327
SMILESC(Cc1c[nH]c2ccccc12)C1CCNCC1