Reaction Details
TargetD(2) dopamine receptor
LigandBDBM50029150
Substrate/Competitorn/a
Meas. Tech.ChEBML_60236
Ki>1000±n/a nM
Citation van Hes, RSmid, PStroomer, CNTipker, KTulp, MTvan der Heyden, JAMcCreary, ACHesselink, MBKruse, CG SLV310, a novel, potential antipsychotic, combining potent dopamine D2 receptor antagonism with serotonin reuptake inhibition. Bioorg Med Chem Lett13:405-8 (2003) D(2) dopamine receptor
Name:D(2) dopamine receptor
Type:Cell-surface receptors
Mol. Mass.:50647.10
Organism:Homo sapiens (Human)
Description:P14416
Residue:443
BDBM50029150
NameBDBM50029150
Synonyms:3-(2-Piperidin-4-yl-ethyl)-1H-indole Indalpine
TypeSmall organic molecule
Emp. Form.C15H20N2
Mol. Mass.228.3327
SMILESC(Cc1c[nH]c2ccccc12)C1CCNCC1