Reaction Details
TargetInosine-5'-monophosphate dehydrogenase 2
LigandBDBM50222632
Substrate/Competitorn/a
Meas. Tech.ChEMBL_89930 (CHEMBL699556)
IC50<10±n/a nM
Citation Dhar, TGWatterson, SHChen, PShen, ZGu, HHNorris, DCarlsen, MHaslow, KDPitts, WJGuo, JChorba, JFleener, CARouleau, KATownsend, RHollenbaugh, DIwanowicz, EJ Quinolone-based IMPDH inhibitors: introduction of basic residues on ring D and SAR of the corresponding mono, di and benzofused analogues. Bioorg Med Chem Lett13:547-51 (2003) Inosine-5'-monophosphate dehydrogenase 2
Name:Inosine-5'-monophosphate dehydrogenase 2
Type:Enzyme
Mol. Mass.:55806.87
Organism:Homo sapiens (Human)
Description:Recombinant IMPDH2 expressed in E. coli.
Residue:514
BDBM50222632
NameBDBM50222632
Synonyms:CHEMBL356236
TypeSmall organic molecule
Emp. Form.C23H18N2O4
Mol. Mass.386.4
SMILESCOc1cc2nc(cc(O)c2cc1-c1cnco1)-c1ccc2CCCC(=O)c2c1