Reaction Details
TargetC-C chemokine receptor type 5
LigandBDBM50123443
Substrate/Competitorn/a
Meas. Tech.ChEMBL_39648 (CHEMBL649953)
Ki 11±n/a nM
Citation McCombie, SWTagat, JRVice, SFLin, SISteensma, RPalani, ANeustadt, BRBaroudy, BMStrizki, JMEndres, MCox, KDan, NChou, CC Piperazine-based CCR5 antagonists as HIV-1 inhibitors. III: synthesis, antiviral and pharmacokinetic profiles of symmetrical heteroaryl carboxamides. Bioorg Med Chem Lett13:567-71 (2003) C-C chemokine receptor type 5
Name:C-C chemokine receptor type 5
Type:Enzyme
Mol. Mass.:40540.21
Organism:Homo sapiens (Human)
Description:P51681
Residue:352
BDBM50123443
NameBDBM50123443
Synonyms:(4,6-Dimethyl-pyrimidin-5-yl)-(4-{(S)-4-[(S)-1-(4-iodo-phenyl)-ethyl]-3-methyl-piperazin-1-yl}-4-methyl-piperidin-1-yl)-methanone | CHEMBL422326
TypeSmall organic molecule
Emp. Form.C26H36IN5O
Mol. Mass.561.5014
SMILESC[C@H](N1CCN(C[C@@H]1C)C1(C)CCN(CC1)C(=O)c1c(C)ncnc1C)c1ccc(I)cc1