Reaction Details
TargetC-C chemokine receptor type 5
LigandBDBM50123437
Substrate/Competitorn/a
Meas. Tech.ChEMBL_39648 (CHEMBL649953)
Ki 11±n/a nM
Citation McCombie, SWTagat, JRVice, SFLin, SISteensma, RPalani, ANeustadt, BRBaroudy, BMStrizki, JMEndres, MCox, KDan, NChou, CC Piperazine-based CCR5 antagonists as HIV-1 inhibitors. III: synthesis, antiviral and pharmacokinetic profiles of symmetrical heteroaryl carboxamides. Bioorg Med Chem Lett13:567-71 (2003) C-C chemokine receptor type 5
Name:C-C chemokine receptor type 5
Type:Enzyme
Mol. Mass.:40540.21
Organism:Homo sapiens (Human)
Description:P51681
Residue:352
BDBM50123437
NameBDBM50123437
Synonyms:(2-Methoxy-4,6-dimethyl-pyrimidin-5-yl)-(4-methyl-4-{(S)-3-methyl-4-[(S)-1-(4-trifluoromethyl-phenyl)-ethyl]-piperazin-1-yl}-piperidin-1-yl)-methanone | CHEMBL140706
TypeSmall organic molecule
Emp. Form.C28H38F3N5O2
Mol. Mass.533.6288
SMILESCOc1nc(C)c(C(=O)N2CCC(C)(CC2)N2CCN([C@@H](C)c3ccc(cc3)C(F)(F)F)[C@@H](C)C2)c(C)n1