Reaction Details
TargetPotassium voltage-gated channel subfamily A member 5
LigandBDBM50123507
Substrate/Competitorn/a
Meas. Tech.ChEMBL_214964 (CHEMBL821193)
IC50 300±n/a nM
Citation Peukert, SBrendel, JPirard, BBrüggemann, ABelow, PKleemann, HWHemmerle, HSchmidt, W Identification, synthesis, and activity of novel blockers of the voltage-gated potassium channel Kv1.5. J Med Chem46:486-98 (2003) 
 
Potassium voltage-gated channel subfamily A member 5
Name:Potassium voltage-gated channel subfamily A member 5
Type:Enzyme
Mol. Mass.:67222.47
Organism:Homo sapiens (Human)
Description:P22460
Residue:613
BDBM50123507
NameBDBM50123507
Synonyms:2'-[(3-Phenyl-butyrylamino)-methyl]-biphenyl-2-carboxylic acid (2-pyridin-2-yl-ethyl)-amide | CHEMBL144174
TypeSmall organic molecule
Emp. Form.C31H31N3O2
Mol. Mass.477.5967
SMILESC[C@H](CC(=O)NCc1ccccc1-c1ccccc1C(=O)NCCc1ccccn1)c1ccccc1