Reaction Details
TargetPotassium voltage-gated channel subfamily A member 5
LigandBDBM50123521
Substrate/Competitorn/a
Meas. Tech.ChEMBL_214964 (CHEMBL821193)
IC50 160±n/a nM
Citation Peukert, SBrendel, JPirard, BBrüggemann, ABelow, PKleemann, HWHemmerle, HSchmidt, W Identification, synthesis, and activity of novel blockers of the voltage-gated potassium channel Kv1.5. J Med Chem46:486-98 (2003) 
 
Potassium voltage-gated channel subfamily A member 5
Name:Potassium voltage-gated channel subfamily A member 5
Type:Enzyme
Mol. Mass.:67222.47
Organism:Homo sapiens (Human)
Description:P22460
Residue:613
BDBM50123521
NameBDBM50123521
Synonyms:CHEMBL317791 [2'-(2-Pyridin-2-yl-ethylcarbamoyl)-biphenyl-2-ylmethyl]-carbamic acid 1-phenyl-ethyl ester
TypeSmall organic molecule
Emp. Form.C30H29N3O3
Mol. Mass.479.5696
SMILESC[C@H](OC(=O)NCc1ccccc1-c1ccccc1C(=O)NCCc1ccccn1)c1ccccc1