Reaction Details
TargetCannabinoid receptor 1
LigandBDBM50123690
Substrate/Competitorn/a
Meas. Tech.ChEMBL_46640 (CHEMBL658896)
Ki 4.1±n/a nM
Citation Katoch-Rouse, RPavlova, OACaulder, THoffman, AFMukhin, AGHorti, AG Synthesis, structure-activity relationship, and evaluation of SR141716 analogues: development of central cannabinoid receptor ligands with lower lipophilicity. J Med Chem46:642-5 (2003) 
 
Cannabinoid receptor 1
Name:Cannabinoid receptor 1
Type:G Protein-Coupled Receptor (GPCR)
Mol. Mass.:52856.55
Organism:Rattus norvegicus (rat)
Description:P20272
Residue:473
BDBM50123690
NameBDBM50123690
Synonyms:1-(2,4-Dichloro-phenyl)-5-(4-methoxy-phenyl)-4-methyl-1H-pyrazole-3-carboxylic acid piperidin-1-ylamide | CHEMBL160723
TypeSmall organic molecule
Emp. Form.C23H24Cl2N4O2
Mol. Mass.459.368
SMILESCOc1ccc(cc1)-c1c(C)c(nn1-c1ccc(Cl)cc1Cl)C(=O)NN1CCCCC1