Reaction Details
TargetReverse transcriptase/RNaseH
LigandBDBM50123916
Substrate/Competitorn/a
Meas. Tech.ChEMBL_104172 (CHEMBL714209)
EC50 2000±n/a nM
Citation Ranise, ASpallarossa, ASchenone, SBruno, OBondavalli, FVargiu, LMarceddu, TMura, MLa Colla, PPani, A Design, synthesis, SAR, and molecular modeling studies of acylthiocarbamates: a novel series of potent non-nucleoside HIV-1 reverse transcriptase inhibitors structurally related to phenethylthiazolylthiourea derivatives. J Med Chem46:768-81 (2003) 
 
Reverse transcriptase/RNaseH
Name:Reverse transcriptase/RNaseH
Type:PROTEIN
Mol. Mass.:65229.15
Organism:Human immunodeficiency virus 1
Description:ChEMBL_1473730
Residue:566
BDBM50123916
NameBDBM50123916
Synonyms:CHEMBL349827 | Phenyl-(thiophene-2-carbonyl)-thiocarbamic acid O-(1-methyl-2-phenoxy-ethyl) ester
TypeSmall organic molecule
Emp. Form.C21H19NO3S2
Mol. Mass.397.51
SMILESCC(COc1ccccc1)OC(=S)N(C(=O)c1cccs1)c1ccccc1