Reaction Details
TargetReverse transcriptase/RNaseH
LigandBDBM1866
Substrate/Competitorn/a
Meas. Tech.ChEMBL_104172 (CHEMBL714209)
EC50 20±n/a nM
Citation Ranise, ASpallarossa, ASchenone, SBruno, OBondavalli, FVargiu, LMarceddu, TMura, MLa Colla, PPani, A Design, synthesis, SAR, and molecular modeling studies of acylthiocarbamates: a novel series of potent non-nucleoside HIV-1 reverse transcriptase inhibitors structurally related to phenethylthiazolylthiourea derivatives. J Med Chem46:768-81 (2003) 
 
Reverse transcriptase/RNaseH
Name:Reverse transcriptase/RNaseH
Type:PROTEIN
Mol. Mass.:65229.15
Organism:Human immunodeficiency virus 1
Description:ChEMBL_1473730
Residue:566
BDBM1866
NameBDBM1866
Synonyms:3-(5-bromopyridin-2-yl)-1-[2-(pyridin-2-yl)ethyl]thiourea hydrochloride LY300046HCl PETT deriv. | Trovirdine
TypeSmall organic molecule
Emp. Form.C13H13BrN4S
Mol. Mass.337.238
SMILESBrc1ccc(NC(=S)NCCc2ccccn2)nc1