Reaction Details
TargetReverse transcriptase/RNaseH
LigandBDBM50123918
Substrate/Competitorn/a
Meas. Tech.ChEMBL_104172 (CHEMBL714209)
EC50 10300±n/a nM
Citation Ranise, ASpallarossa, ASchenone, SBruno, OBondavalli, FVargiu, LMarceddu, TMura, MLa Colla, PPani, A Design, synthesis, SAR, and molecular modeling studies of acylthiocarbamates: a novel series of potent non-nucleoside HIV-1 reverse transcriptase inhibitors structurally related to phenethylthiazolylthiourea derivatives. J Med Chem46:768-81 (2003) 
 
Reverse transcriptase/RNaseH
Name:Reverse transcriptase/RNaseH
Type:PROTEIN
Mol. Mass.:65229.15
Organism:Human immunodeficiency virus 1
Description:ChEMBL_1473730
Residue:566
BDBM50123918
NameBDBM50123918
Synonyms:(4-Chloro-benzoyl)-phenyl-thiocarbamic acid O-(2-phenoxy-ethyl) ester | CHEMBL164011
TypeSmall organic molecule
Emp. Form.C22H18ClNO3S
Mol. Mass.411.901
SMILESClc1ccc(cc1)C(=O)N(C(=S)OCCOc1ccccc1)c1ccccc1