Reaction Details
TargetReverse transcriptase/RNaseH
LigandBDBM50123880
Substrate/Competitorn/a
Meas. Tech.ChEMBL_104172 (CHEMBL714209)
EC50 5.00±n/a nM
Citation Ranise, ASpallarossa, ASchenone, SBruno, OBondavalli, FVargiu, LMarceddu, TMura, MLa Colla, PPani, A Design, synthesis, SAR, and molecular modeling studies of acylthiocarbamates: a novel series of potent non-nucleoside HIV-1 reverse transcriptase inhibitors structurally related to phenethylthiazolylthiourea derivatives. J Med Chem46:768-81 (2003) 
 
Reverse transcriptase/RNaseH
Name:Reverse transcriptase/RNaseH
Type:PROTEIN
Mol. Mass.:65229.15
Organism:Human immunodeficiency virus 1
Description:ChEMBL_1473730
Residue:566
BDBM50123880
NameBDBM50123880
Synonyms:(4-Chloro-phenyl)-(2-chloro-pyridine-4-carbonyl)-thiocarbamic acid O-[2-(1,3-dioxo-1,3-dihydro-isoindol-2-yl)-ethyl] ester | CHEMBL166126
TypeSmall organic molecule
Emp. Form.C23H15Cl2N3O4S
Mol. Mass.500.354
SMILESClc1ccc(cc1)N(C(=S)OCCN1C(=O)c2ccccc2C1=O)C(=O)c1ccnc(Cl)c1