Reaction Details
TargetReverse transcriptase/RNaseH
LigandBDBM50123913
Substrate/Competitorn/a
Meas. Tech.ChEMBL_104172 (CHEMBL714209)
EC50 11000±n/a nM
Citation Ranise, ASpallarossa, ASchenone, SBruno, OBondavalli, FVargiu, LMarceddu, TMura, MLa Colla, PPani, A Design, synthesis, SAR, and molecular modeling studies of acylthiocarbamates: a novel series of potent non-nucleoside HIV-1 reverse transcriptase inhibitors structurally related to phenethylthiazolylthiourea derivatives. J Med Chem46:768-81 (2003) 
 
Reverse transcriptase/RNaseH
Name:Reverse transcriptase/RNaseH
Type:PROTEIN
Mol. Mass.:65229.15
Organism:Human immunodeficiency virus 1
Description:ChEMBL_1473730
Residue:566
BDBM50123913
NameBDBM50123913
Synonyms:(4-Diethylamino-phenyl)-(thiophene-2-carbonyl)-thiocarbamic acid O-[2-(1,3-dioxo-1,3-dihydro-isoindol-2-yl)-ethyl] ester | CHEMBL349462
TypeSmall organic molecule
Emp. Form.C26H25N3O4S2
Mol. Mass.507.624
SMILESCCN(CC)c1ccc(cc1)N(C(=S)OCCN1C(=O)c2ccccc2C1=O)C(=O)c1cccs1