Reaction Details
TargetReverse transcriptase/RNaseH
LigandBDBM50123926
Substrate/Competitorn/a
Meas. Tech.ChEMBL_104172 (CHEMBL714209)
EC50 7700±n/a nM
Citation Ranise, ASpallarossa, ASchenone, SBruno, OBondavalli, FVargiu, LMarceddu, TMura, MLa Colla, PPani, A Design, synthesis, SAR, and molecular modeling studies of acylthiocarbamates: a novel series of potent non-nucleoside HIV-1 reverse transcriptase inhibitors structurally related to phenethylthiazolylthiourea derivatives. J Med Chem46:768-81 (2003) 
 
Reverse transcriptase/RNaseH
Name:Reverse transcriptase/RNaseH
Type:PROTEIN
Mol. Mass.:65229.15
Organism:Human immunodeficiency virus 1
Description:ChEMBL_1473730
Residue:566
BDBM50123926
NameBDBM50123926
Synonyms:CHEMBL165121 | Phenyl-(3-phenyl-acryloyl)-thiocarbamic acid O-(2-phenoxy-ethyl) ester
TypeSmall organic molecule
Emp. Form.C24H21NO3S
Mol. Mass.403.493
SMILESO=C(\C=C\c1ccccc1)N(C(=S)OCCOc1ccccc1)c1ccccc1