Reaction Details
TargetBcl-2-like protein 1
LigandBDBM209056
Substrate/Competitorn/a
Meas. Tech.ChEMBL_2075077 (CHEMBL4730611)
Ki 5.0±n/a nM
Citation Wang, LDoherty, GAJudd, ASTao, ZFHansen, TMFrey, RRSong, XBruncko, MKunzer, ARWang, XWendt, MDFlygare, JACatron, NDJudge, RAPark, CHShekhar, SPhillips, DCNimmer, PSmith, MLTahir, SKXiao, YXue, JZhang, HLe, PNMitten, MJBoghaert, ERGao, WKovar, PChoo, EFDiaz, DFairbrother, WJElmore, SWSampath, DLeverson, JDSouers, AJ Discovery of A-1331852, a First-in-Class, Potent, and Orally-Bioavailable BCL-X ACS Med Chem Lett11:1829-1836 (2020) 
 
Bcl-2-like protein 1
Name:Bcl-2-like protein 1
Type:Mitochondrion membrane; Single-pass membrane protein
Mol. Mass.:26039.60
Organism:Homo sapiens (Human)
Description:n/a
Residue:233
BDBM209056
NameBDBM209056
Synonyms:US9266877, 2
TypeSmall organic molecule
Emp. Form.C32H25N7O3S
Mol. Mass.587.651
SMILESOC(=O)c1nc(ccc1-c1cnn(Cc2ccncc2)c1)N1CCc2cccc(C(=O)Nc3nc4ccccc4s3)c2C1