Reaction Details
TargetApoptosis regulator Bcl-2
LigandBDBM209097
Substrate/Competitorn/a
Meas. Tech.ChEMBL_2075079 (CHEMBL4730613)
Ki 29±n/a nM
Citation Wang, LDoherty, GAJudd, ASTao, ZFHansen, TMFrey, RRSong, XBruncko, MKunzer, ARWang, XWendt, MDFlygare, JACatron, NDJudge, RAPark, CHShekhar, SPhillips, DCNimmer, PSmith, MLTahir, SKXiao, YXue, JZhang, HLe, PNMitten, MJBoghaert, ERGao, WKovar, PChoo, EFDiaz, DFairbrother, WJElmore, SWSampath, DLeverson, JDSouers, AJ Discovery of A-1331852, a First-in-Class, Potent, and Orally-Bioavailable BCL-X ACS Med Chem Lett11:1829-1836 (2020) 
 
Apoptosis regulator Bcl-2
Name:Apoptosis regulator Bcl-2
Type:Homodimer or heterodimer
Mol. Mass.:26269.11
Organism:Homo sapiens (Human)
Description:P10415
Residue:239
BDBM209097
NameBDBM209097
Synonyms:US9266877, 43
TypeSmall organic molecule
Emp. Form.C34H34N6O3S
Mol. Mass.606.737
SMILESCc1c(cnn1CC1CCCCC1)-c1ccc(nc1C(O)=O)N1CCc2cccc(C(=O)Nc3nc4ccccc4s3)c2C1