Reaction Details
TargetPeroxisome proliferator-activated receptor alpha
LigandBDBM50124369
Substrate/Competitorn/a
Meas. Tech.ChEMBL_153549 (CHEMBL766090)
Ki 14±n/a nM
Citation Adams, ADYuen, WHu, ZSantini, CJones, ABMacNaul, KLBerger, JPDoebber, TWMoller, DE Amphipathic 3-phenyl-7-propylbenzisoxazoles; human pPaR gamma, delta and alpha agonists. Bioorg Med Chem Lett13:931-5 (2003) Peroxisome proliferator-activated receptor alpha
Name:Peroxisome proliferator-activated receptor alpha
Type:Enzyme
Mol. Mass.:52222.08
Organism:Homo sapiens (Human)
Description:Q07869
Residue:468
BDBM50124369
NameBDBM50124369
Synonyms:CHEMBL367019 | {3-Chloro-4-[3-(3-phenyl-7-propyl-benzo[d]isoxazol-6-yloxy)-propylsulfanyl]-phenyl}-acetic acid
TypeSmall organic molecule
Emp. Form.C27H26ClNO4S
Mol. Mass.496.018
SMILESCCCc1c(OCCCSc2ccc(CC(O)=O)cc2Cl)ccc2c(noc12)-c1ccccc1