Reaction Details
TargetSodium-dependent dopamine transporter
LigandBDBM50006774
Substrate/Competitorn/a
Meas. Tech.ChEMBL_61668 (CHEMBL670046)
Ki 0.48±n/a nM
Citation Goodman, MMChen, PPlisson, CMartarello, LGalt, JVotaw, JRKilts, CDMalveaux, GCamp, VMShi, BEly, TDHowell, LMcConathy, JNemeroff, CB Synthesis and characterization of iodine-123 labeled 2beta-carbomethoxy-3beta-(4'-((Z)-2-iodoethenyl)phenyl)nortropane. A ligand for in vivo imaging of serotonin transporters by single-photon-emission tomography. J Med Chem46:925-35 (2003) 
 
Sodium-dependent dopamine transporter
Name:Sodium-dependent dopamine transporter
Type:Multi-pass membrane protein
Mol. Mass.:68497.11
Organism:Homo sapiens (Human)
Description:Q01959
Residue:620
BDBM50006774
NameBDBM50006774
Synonyms:(2S,3S)-methyl 3-(4-iodophenyl)-8-methyl-8-aza-bicyclo[3.2.1]octane-2-carboxylate CHEMBL311347 | methyl 3-(4-iodophenyl)-8-methyl-(2S,3S)-8-azabicyclo[3.2.1]octane-2-carboxylate
TypeSmall organic molecule
Emp. Form.C16H20INO2
Mol. Mass.385.24
SMILESCOC(=O)[C@@H]1C2CC[C@H](C[C@@H]1c1ccc(I)cc1)N2C