Reaction Details
TargetSodium-dependent dopamine transporter
LigandBDBM50124567
Substrate/Competitorn/a
Meas. Tech.ChEMBL_61668 (CHEMBL670046)
Ki 1.88±n/a nM
Citation Goodman, MMChen, PPlisson, CMartarello, LGalt, JVotaw, JRKilts, CDMalveaux, GCamp, VMShi, BEly, TDHowell, LMcConathy, JNemeroff, CB Synthesis and characterization of iodine-123 labeled 2beta-carbomethoxy-3beta-(4'-((Z)-2-iodoethenyl)phenyl)nortropane. A ligand for in vivo imaging of serotonin transporters by single-photon-emission tomography. J Med Chem46:925-35 (2003) 
 
Sodium-dependent dopamine transporter
Name:Sodium-dependent dopamine transporter
Type:Multi-pass membrane protein
Mol. Mass.:68497.11
Organism:Homo sapiens (Human)
Description:Q01959
Residue:620
BDBM50124567
NameBDBM50124567
Synonyms:CHEMBL173427 | methyl 3-{4-[2-iodo-(E)-1-ethenyl]phenyl}-(2S,3S)-8-azabicyclo[3.2.1]octane-2-carboxylate
TypeSmall organic molecule
Emp. Form.C17H20INO2
Mol. Mass.397.2507
SMILESCOC(=O)[C@@H]1C2CCC(C[C@@H]1c1ccc(\C=C\I)cc1)N2