Reaction Details
TargetGlucocorticoid receptor
LigandBDBM50124603
Substrate/Competitorn/a
Meas. Tech.ChEMBL_71398 (CHEMBL874034)
Ki 1.9±n/a nM
Citation Kym, PRKort, MECoghlan, MJMoore, JLTang, RRatajczyk, JDLarson, DPElmore, SWPratt, JKStashko, MAFalls, HDLin, CWNakane, MMiller, LTyree, CMMiner, JNJacobson, PBWilcox, DMNguyen, PLane, BC Nonsteroidal selective glucocorticoid modulators: the effect of C-10 substitution on receptor selectivity and functional potency of 5-allyl-2,5-dihydro-2,2,4-trimethyl-1H-[1]benzopyrano[3,4-f]quinolines. J Med Chem46:1016-30 (2003) 
 
Glucocorticoid receptor
Name:Glucocorticoid receptor
Type:Enzyme
Mol. Mass.:85656.87
Organism:Homo sapiens (Human)
Description:P04150
Residue:777
BDBM50124603
NameBDBM50124603
Synonyms:5-Allyl-10-chloro-2,2,4-trimethyl-2,5-dihydro-1H-6-oxa-1-aza-chrysene | CHEMBL8007
TypeSmall organic molecule
Emp. Form.C22H22ClNO
Mol. Mass.351.869
SMILESCC1=CC(C)(C)Nc2ccc-3c(C(CC=C)Oc4cccc(Cl)c-34)c12