Reaction Details
TargetProgesterone receptor
LigandBDBM50124591
Substrate/Competitorn/a
Meas. Tech.ChEBML_159729
Ki 22±n/a nM
Citation Kym, PRKort, MECoghlan, MJMoore, JLTang, RRatajczyk, JDLarson, DPElmore, SWPratt, JKStashko, MAFalls, HDLin, CWNakane, MMiller, LTyree, CMMiner, JNJacobson, PBWilcox, DMNguyen, PLane, BC Nonsteroidal selective glucocorticoid modulators: the effect of C-10 substitution on receptor selectivity and functional potency of 5-allyl-2,5-dihydro-2,2,4-trimethyl-1H-[1]benzopyrano[3,4-f]quinolines. J Med Chem46:1016-30 (2003) 
 
Progesterone receptor
Name:Progesterone receptor
Type:Protein
Mol. Mass.:98979.52
Organism:Homo sapiens (Human)
Description:P06401
Residue:933
BDBM50124591
NameBDBM50124591
Synonyms:5-Allyl-7-bromo-10-chloro-2,2,4-trimethyl-2,5-dihydro-1H-6-oxa-1-aza-chrysen-9-ol | CHEMBL7781
TypeSmall organic molecule
Emp. Form.C22H21BrClNO2
Mol. Mass.446.765
SMILESCC1=CC(C)(C)Nc2ccc-3c(C(CC=C)Oc4c(Br)cc(O)c(Cl)c-34)c12