Reaction Details
TargetGag-Pol polyprotein [489-587]
LigandBDBM50124722
Substrate/Competitorn/a
Meas. Tech.ChEBML_157538
Ki 0.047000±n/a nM
Citation Kaltenbach, RFPatel, MWaltermire, REHarris, GDStone, BRKlabe, RMGarber, SBacheler, LTCordova, BCLogue, KWright, MRErickson-Viitanen, STrainor, GL Synthesis, antiviral activity and pharmacokinetics of P1/P1' substituted 3-aminoindazole cyclic urea HIV protease inhibitors. Bioorg Med Chem Lett13:605-8 (2003) Gag-Pol polyprotein [489-587]
Name:Gag-Pol polyprotein [489-587]
Type:Enzyme Subunit
Mol. Mass.:10781.16
Organism:Human immunodeficiency virus type 1
Description:P04585[489-587]
Residue:99
BDBM50124722
NameBDBM50124722
Synonyms:(4R,5S,6S,7R)-1-(3-Amino-1H-indazol-5-ylmethyl)-3-benzyl-5,6-dihydroxy-4,7-bis-(4-methyl-benzyl)-[1,3]diazepan-2-one | CHEMBL154722
TypeSmall organic molecule
Emp. Form.C36H39N5O3
Mol. Mass.589.7266
SMILESCc1ccc(C[C@@H]2[C@H](O)[C@@H](O)[C@@H](Cc3ccc(C)cc3)N(Cc3ccc4[nH]nc(N)c4c3)C(=O)N2Cc2ccccc2)cc1