Reaction Details
TargetGlutamate receptor ionotropic, NMDA 2B
LigandBDBM50124918
Substrate/Competitorn/a
Meas. Tech.ChEMBL_141157 (CHEMBL749675)
Ki 12±n/a nM
Citation Claiborne, CFMcCauley, JALibby, BECurtis, NRDiggle, HJKulagowski, JJMichelson, SRAnderson, KDClaremon, DAFreidinger, RMBednar, RAMosser, SDGaul, SLConnolly, TMCondra, CLBednar, BStump, GLLynch, JJMacaulay, AWafford, KAKoblan, KSLiverton, NJ Orally efficacious NR2B-selective NMDA receptor antagonists. Bioorg Med Chem Lett13:697-700 (2003) Glutamate receptor ionotropic, NMDA 2B
Name:Glutamate receptor ionotropic, NMDA 2B
Type:PROTEIN
Mol. Mass.:166375.46
Organism:Homo sapiens (Human)
Description:ChEMBL_1438829
Residue:1484
BDBM50124918
NameBDBM50124918
Synonyms:3,4-Dichloro-N-(2-trifluoromethoxy-benzyl)-benzamidine | CHEMBL161876
TypeSmall organic molecule
Emp. Form.C15H11Cl2F3N2O
Mol. Mass.363.162
SMILESNC(=NCc1ccccc1OC(F)(F)F)c1ccc(Cl)c(Cl)c1