Reaction Details
TargetGlutamate receptor ionotropic, NMDA 2B
LigandBDBM50124919
Substrate/Competitorn/a
Meas. Tech.ChEMBL_141157 (CHEMBL749675)
Ki 16±n/a nM
Citation Claiborne, CFMcCauley, JALibby, BECurtis, NRDiggle, HJKulagowski, JJMichelson, SRAnderson, KDClaremon, DAFreidinger, RMBednar, RAMosser, SDGaul, SLConnolly, TMCondra, CLBednar, BStump, GLLynch, JJMacaulay, AWafford, KAKoblan, KSLiverton, NJ Orally efficacious NR2B-selective NMDA receptor antagonists. Bioorg Med Chem Lett13:697-700 (2003) Glutamate receptor ionotropic, NMDA 2B
Name:Glutamate receptor ionotropic, NMDA 2B
Type:PROTEIN
Mol. Mass.:166375.46
Organism:Homo sapiens (Human)
Description:ChEMBL_1438829
Residue:1484
BDBM50124919
NameBDBM50124919
Synonyms:3,4-Dichloro-N-(3-chloro-benzyl)-benzamidine | CHEMBL159818
TypeSmall organic molecule
Emp. Form.C14H11Cl3N2
Mol. Mass.313.61
SMILESNC(=NCc1cccc(Cl)c1)c1ccc(Cl)c(Cl)c1