Reaction Details
TargetGlutamate receptor ionotropic, NMDA 2B
LigandBDBM50124908
Substrate/Competitorn/a
Meas. Tech.ChEMBL_141157 (CHEMBL749675)
Ki 5.7±n/a nM
Citation Claiborne, CFMcCauley, JALibby, BECurtis, NRDiggle, HJKulagowski, JJMichelson, SRAnderson, KDClaremon, DAFreidinger, RMBednar, RAMosser, SDGaul, SLConnolly, TMCondra, CLBednar, BStump, GLLynch, JJMacaulay, AWafford, KAKoblan, KSLiverton, NJ Orally efficacious NR2B-selective NMDA receptor antagonists. Bioorg Med Chem Lett13:697-700 (2003) Glutamate receptor ionotropic, NMDA 2B
Name:Glutamate receptor ionotropic, NMDA 2B
Type:PROTEIN
Mol. Mass.:166375.46
Organism:Homo sapiens (Human)
Description:ChEMBL_1438829
Residue:1484
BDBM50124908
NameBDBM50124908
Synonyms:CHEMBL159560 | N-(2-Methoxy-benzyl)-4-trifluoromethoxy-benzamidine
TypeSmall organic molecule
Emp. Form.C16H15F3N2O2
Mol. Mass.324.2977
SMILESCOc1ccccc1CN=C(N)c1ccc(OC(F)(F)F)cc1