Reaction Details
TargetC-C chemokine receptor type 5
LigandBDBM50124940
Substrate/Competitorn/a
Meas. Tech.ChEBML_39653
Ki 97.8±n/a nM
Citation Palani, AShapiro, SClader, JWGreenlee, WJBlythin, DCox, KWagner, NEStrizki, JBaroudy, BMDan, N Biological evaluation and interconversion studies of rotamers of SCH 351125, an orally bioavailable CCR5 antagonist. Bioorg Med Chem Lett13:705-8 (2003) C-C chemokine receptor type 5
Name:C-C chemokine receptor type 5
Type:Enzyme
Mol. Mass.:40540.21
Organism:Homo sapiens (Human)
Description:P51681
Residue:352
BDBM50124940
NameBDBM50124940
Synonyms:(2,4-Dimethyl-1-oxy-pyridin-3-yl)-(4'-methyl-[1,4']bipiperidinyl-1'-yl)-methanone | CHEMBL163078
TypeSmall organic molecule
Emp. Form.C19H29N3O2
Mol. Mass.331.4525
SMILESCc1cc[n+]([O-])c(C)c1C(=O)N1CCC(C)(CC1)N1CCCCC1