Reaction Details
Target5-hydroxytryptamine receptor 2A
LigandBDBM50125168
Substrate/Competitorn/a
Meas. Tech.ChEBML_2457
Ki 3.7±n/a nM
Citation Lee, TRobichaud, AJBoyle, KELu, YRobertson, DWMiller, KJFitzgerald, LWMcElroy, JFLargent, BL Novel, highly potent, selective 5-HT2A/D2 receptor antagonists as potential atypical antipsychotics. Bioorg Med Chem Lett13:767-70 (2003) 5-hydroxytryptamine receptor 2A
Name:5-hydroxytryptamine receptor 2A
Type:undefined
Mol. Mass.:52607.65
Organism:Homo sapiens (Human)
Description:P28223
Residue:471
BDBM50125168
NameBDBM50125168
Synonyms:1-(2-Amino-phenyl)-4-(7aR,11aS)-5,6,8,9,11,11a-hexahydro-4H,7aH-pyrido[3',4':4,5]pyrrolo[3,2,1-ij]quinolin-10-yl-butan-1-one | CHEMBL352686
TypeSmall organic molecule
Emp. Form.C24H29N3O
Mol. Mass.375.5066
SMILESNc1ccccc1C(=O)CCCN1CC[C@@H]2[C@H](C1)c1cccc3CCCN2c13