Reaction Details
Target5-hydroxytryptamine receptor 2A
LigandBDBM50125169
Substrate/Competitorn/a
Meas. Tech.ChEBML_2457
Ki 0.800000±n/a nM
Citation Lee, TRobichaud, AJBoyle, KELu, YRobertson, DWMiller, KJFitzgerald, LWMcElroy, JFLargent, BL Novel, highly potent, selective 5-HT2A/D2 receptor antagonists as potential atypical antipsychotics. Bioorg Med Chem Lett13:767-70 (2003) 5-hydroxytryptamine receptor 2A
Name:5-hydroxytryptamine receptor 2A
Type:undefined
Mol. Mass.:52607.65
Organism:Homo sapiens (Human)
Description:P28223
Residue:471
BDBM50125169
NameBDBM50125169
Synonyms:1-(2-Amino-phenyl)-4-(6bR,10aS)-1,2,6b,9,10,10a-hexahydro-7H-3-thia-8,10b-diaza-fluoranthen-8-yl-butan-1-one | CHEMBL163742
TypeSmall organic molecule
Emp. Form.C23H27N3OS
Mol. Mass.393.545
SMILESNc1ccccc1C(=O)CCCN1CC[C@H]2[C@@H](C1)c1cccc3SCCN2c13