Reaction Details
Target5-hydroxytryptamine receptor 2A
LigandBDBM50222896
Substrate/Competitorn/a
Meas. Tech.ChEMBL_2521 (CHEMBL617254)
Ki 269±n/a nM
Citation Forbes, ITCooper, DGDodds, EKDouglas, SEGribble, ADIfe, RJLightfoot, APMeeson, MCampbell, LPColeman, TRiley, GJThomas, DR Identification of a novel series of selective 5-HT7 receptor antagonists. Bioorg Med Chem Lett13:1055-8 (2003) 5-hydroxytryptamine receptor 2A
Name:5-hydroxytryptamine receptor 2A
Type:undefined
Mol. Mass.:52607.65
Organism:Homo sapiens (Human)
Description:P28223
Residue:471
BDBM50222896
NameBDBM50222896
Synonyms:CHEMBL275475
TypeSmall organic molecule
Emp. Form.C23H27N5O
Mol. Mass.389.4934
SMILESO=C1N(CCN2CCC(CC2)n2nnc3ccccc23)CCCc2ccccc12