Reaction Details
Target5-hydroxytryptamine receptor 2A
LigandBDBM50222892
Substrate/Competitorn/a
Meas. Tech.ChEMBL_2521 (CHEMBL617254)
Ki 224±n/a nM
Citation Forbes, ITCooper, DGDodds, EKDouglas, SEGribble, ADIfe, RJLightfoot, APMeeson, MCampbell, LPColeman, TRiley, GJThomas, DR Identification of a novel series of selective 5-HT7 receptor antagonists. Bioorg Med Chem Lett13:1055-8 (2003) 5-hydroxytryptamine receptor 2A
Name:5-hydroxytryptamine receptor 2A
Type:undefined
Mol. Mass.:52607.65
Organism:Homo sapiens (Human)
Description:P28223
Residue:471
BDBM50222892
NameBDBM50222892
Synonyms:CHEMBL275258
TypeSmall organic molecule
Emp. Form.C25H29N3O2
Mol. Mass.403.5167
SMILESO=C1Cc2ccccc2N1C1CCN(CCN2CCCc3ccccc3C2=O)CC1