Reaction Details
Target5-hydroxytryptamine receptor 2A
LigandBDBM50222889
Substrate/Competitorn/a
Meas. Tech.ChEMBL_2521 (CHEMBL617254)
Ki 74±n/a nM
Citation Forbes, ITCooper, DGDodds, EKDouglas, SEGribble, ADIfe, RJLightfoot, APMeeson, MCampbell, LPColeman, TRiley, GJThomas, DR Identification of a novel series of selective 5-HT7 receptor antagonists. Bioorg Med Chem Lett13:1055-8 (2003) 5-hydroxytryptamine receptor 2A
Name:5-hydroxytryptamine receptor 2A
Type:undefined
Mol. Mass.:52607.65
Organism:Homo sapiens (Human)
Description:P28223
Residue:471
BDBM50222889
NameBDBM50222889
Synonyms:CHEMBL429202
TypeSmall organic molecule
Emp. Form.C23H27ClN2O2
Mol. Mass.398.926
SMILESClc1ccc(OC2CCN(CCN3CCCc4ccccc4C3=O)CC2)cc1