Reaction Details
Target5-hydroxytryptamine receptor 2B
LigandBDBM50125260
Substrate/Competitorn/a
Meas. Tech.ChEMBL_2881 (CHEMBL617784)
Ki 1000±n/a nM
Citation Forbes, ITCooper, DGDodds, EKDouglas, SEGribble, ADIfe, RJLightfoot, APMeeson, MCampbell, LPColeman, TRiley, GJThomas, DR Identification of a novel series of selective 5-HT7 receptor antagonists. Bioorg Med Chem Lett13:1055-8 (2003) 5-hydroxytryptamine receptor 2B
Name:5-hydroxytryptamine receptor 2B
Type:G Protein-Coupled Receptor (GPCR)
Mol. Mass.:54312.47
Organism:Homo sapiens (Human)
Description:Receptor binding assays were performed using human clone stably expressed in CHO cells.
Residue:481
BDBM50125260
NameBDBM50125260
Synonyms:2-{2-[4-(5-Fluoro-2-oxo-2,3-dihydro-benzoimidazol-1-yl)-piperidin-1-yl]-ethyl}-2,3,4,5-tetrahydro-benzo[c]azepin-1-one | CHEMBL273921
TypeSmall organic molecule
Emp. Form.C24H27FN4O2
Mol. Mass.422.4952
SMILESFc1ccc2n(C3CCN(CCN4CCCc5ccccc5C4=O)CC3)c(=O)[nH]c2c1