Reaction Details
TargetDelta-type opioid receptor
LigandBDBM50125450
Substrate/Competitorn/a
Meas. Tech.ChEBML_145338
IC50 5600±n/a nM
Citation Semple, GAndersson, BMChhajlani, VGeorgsson, JJohansson, MJRosenquist, ASwanson, L Synthesis and Biological activity of kappa opioid receptor agonists. Part 2: preparation of 3-aryl-2-pyridone analogues generated by solution- and solid-phase parallel synthesis methods. Bioorg Med Chem Lett13:1141-5 (2003) Delta-type opioid receptor
Name:Delta-type opioid receptor
Type:G Protein-Coupled Receptor (GPCR)
Mol. Mass.:40382.98
Organism:Homo sapiens (Human)
Description:Competition binding assays were carried out using membrane preparations from transfected HN9.10 cells that constitutively expressed the delta opioid receptor.
Residue:372
BDBM50125450
NameBDBM50125450
Synonyms:(3-{1-[2-Oxo-3-(4-trifluoromethyl-phenyl)-2H-pyridin-1-yl]-2-pyrrolidin-1-yl-ethyl}-phenoxy)-acetic acid | CHEMBL15429
TypeSmall organic molecule
Emp. Form.C26H25F3N2O4
Mol. Mass.486.4829
SMILESOC(=O)COc1cccc(c1)C(CN1CCCC1)n1cccc(-c2ccc(cc2)C(F)(F)F)c1=O