Reaction Details
TargetDelta-type opioid receptor
LigandBDBM50125448
Substrate/Competitorn/a
Meas. Tech.ChEBML_145338
IC50>10000±n/a nM
Citation Semple, GAndersson, BMChhajlani, VGeorgsson, JJohansson, MJRosenquist, ASwanson, L Synthesis and Biological activity of kappa opioid receptor agonists. Part 2: preparation of 3-aryl-2-pyridone analogues generated by solution- and solid-phase parallel synthesis methods. Bioorg Med Chem Lett13:1141-5 (2003) Delta-type opioid receptor
Name:Delta-type opioid receptor
Type:G Protein-Coupled Receptor (GPCR)
Mol. Mass.:40382.98
Organism:Homo sapiens (Human)
Description:Competition binding assays were carried out using membrane preparations from transfected HN9.10 cells that constitutively expressed the delta opioid receptor.
Residue:372
BDBM50125448
NameBDBM50125448
Synonyms:1-[1-(4-Methoxy-phenyl)-2-pyrrolidin-1-yl-ethyl]-3-(4-trifluoromethyl-phenyl)-1H-pyridin-2-one | CHEMBL15354
TypeSmall organic molecule
Emp. Form.C25H25F3N2O2
Mol. Mass.442.4734
SMILESCOc1ccc(cc1)C(CN1CCCC1)n1cccc(-c2ccc(cc2)C(F)(F)F)c1=O