Reaction Details
TargetDelta-type opioid receptor
LigandBDBM50125455
Substrate/Competitorn/a
Meas. Tech.ChEBML_145338
IC50>10000±n/a nM
Citation Semple, GAndersson, BMChhajlani, VGeorgsson, JJohansson, MJRosenquist, ASwanson, L Synthesis and Biological activity of kappa opioid receptor agonists. Part 2: preparation of 3-aryl-2-pyridone analogues generated by solution- and solid-phase parallel synthesis methods. Bioorg Med Chem Lett13:1141-5 (2003) Delta-type opioid receptor
Name:Delta-type opioid receptor
Type:G Protein-Coupled Receptor (GPCR)
Mol. Mass.:40382.98
Organism:Homo sapiens (Human)
Description:Competition binding assays were carried out using membrane preparations from transfected HN9.10 cells that constitutively expressed the delta opioid receptor.
Residue:372
BDBM50125455
NameBDBM50125455
Synonyms:1-[2-(3-Hydroxy-pyrrolidin-1-yl)-1-phenyl-ethyl]-3-(3-trifluoromethoxy-phenyl)-1H-pyridin-2-one | CHEMBL278062
TypeSmall organic molecule
Emp. Form.C24H23F3N2O3
Mol. Mass.444.4462
SMILESOC1CCN(CC(c2ccccc2)n2cccc(-c3cccc(OC(F)(F)F)c3)c2=O)C1