Reaction Details
TargetKappa-type opioid receptor
LigandBDBM50125450
Substrate/Competitorn/a
Meas. Tech.ChEBML_145114
IC50 420±n/a nM
Citation Semple, GAndersson, BMChhajlani, VGeorgsson, JJohansson, MJRosenquist, ASwanson, L Synthesis and Biological activity of kappa opioid receptor agonists. Part 2: preparation of 3-aryl-2-pyridone analogues generated by solution- and solid-phase parallel synthesis methods. Bioorg Med Chem Lett13:1141-5 (2003) Kappa-type opioid receptor
Name:Kappa-type opioid receptor
Type:G Protein-Coupled Receptor (GPCR)
Mol. Mass.:42648.76
Organism:Homo sapiens (Human)
Description:P41145
Residue:380
BDBM50125450
NameBDBM50125450
Synonyms:(3-{1-[2-Oxo-3-(4-trifluoromethyl-phenyl)-2H-pyridin-1-yl]-2-pyrrolidin-1-yl-ethyl}-phenoxy)-acetic acid | CHEMBL15429
TypeSmall organic molecule
Emp. Form.C26H25F3N2O4
Mol. Mass.486.4829
SMILESOC(=O)COc1cccc(c1)C(CN1CCCC1)n1cccc(-c2ccc(cc2)C(F)(F)F)c1=O