Reaction Details
TargetKappa-type opioid receptor
LigandBDBM50108448
Substrate/Competitorn/a
Meas. Tech.ChEBML_145114
IC50 8.7±n/a nM
Citation Semple, GAndersson, BMChhajlani, VGeorgsson, JJohansson, MJRosenquist, ASwanson, L Synthesis and Biological activity of kappa opioid receptor agonists. Part 2: preparation of 3-aryl-2-pyridone analogues generated by solution- and solid-phase parallel synthesis methods. Bioorg Med Chem Lett13:1141-5 (2003) Kappa-type opioid receptor
Name:Kappa-type opioid receptor
Type:G Protein-Coupled Receptor (GPCR)
Mol. Mass.:42648.76
Organism:Homo sapiens (Human)
Description:P41145
Residue:380
BDBM50108448
NameBDBM50108448
Synonyms:1-(1-Phenyl-2-pyrrolidin-1-yl-ethyl)-3-(4-trifluoromethyl-phenyl)-1H-pyridin-2-one | CHEMBL280037
TypeSmall organic molecule
Emp. Form.C24H23F3N2O
Mol. Mass.412.4474
SMILESFC(F)(F)c1ccc(cc1)-c1cccn(C(CN2CCCC2)c2ccccc2)c1=O